{"text_format":"1","workbook":"xlsx","n_sheets":6,"sheets":["Menu principal","Calculos","tablas de factores","imagenes","DDT","Instrucciones"],"not_rendered":{"charts":0,"images":5,"macros":1,"external_links":1,"defined_names":6,"comments":0,"pivot_tables":0},"unopened":[],"bounds":{"document_bytes":16777216,"sheet_cells":100000,"rows_first":2000,"rows_last":500,"rows_between":2000,"halvings":0,"cell_chars":16384,"cell_head_chars":4096},"cells_cut":0,"cells_raw":0,"read":"whole","date_system":"1900"}

{"sheet":"Menu principal","index":0,"n_rows":122,"n_cols":11,"rows_kept":122,"cut":false,"hidden":false,"merged":[[1,0,1,10],[2,0,2,10],[3,1,3,5],[4,1,4,5],[5,1,5,5],[6,1,6,5],[13,1,13,5],[14,0,14,10],[15,0,15,10],[16,1,16,5],[17,1,17,5],[18,1,18,5],[7,1,7,5],[8,1,8,5],[9,1,9,4],[10,1,10,5],[11,1,11,5],[12,1,12,5],[25,1,25,5],[26,0,26,10],[27,1,27,5],[28,1,28,5],[29,1,29,5],[30,1,30,5],[19,1,19,5],[20,1,20,5],[21,1,21,5],[23,1,23,5],[24,1,24,5],[22,4,22,5],[43,4,43,5],[37,1,37,5],[38,1,38,5],[39,1,39,5],[40,1,40,5],[41,1,41,5],[42,1,42,5],[31,1,31,5],[32,1,32,5],[34,1,34,5],[35,1,35,5],[36,0,36,10],[33,4,33,5],[54,5,55,9],[56,0,56,10],[68,1,68,9],[69,1,69,5],[60,0,60,10],[61,1,61,9],[44,1,44,5],[45,1,45,5],[46,0,46,10],[47,0,47,10],[51,0,51,10],[70,0,70,10],[72,1,72,9],[73,0,73,10],[81,0,81,10],[84,0,84,10],[62,1,62,9],[63,1,63,9],[64,1,64,9],[65,1,65,9],[66,1,66,9],[67,1,67,9],[76,0,76,10],[83,0,83,10],[121,1,121,10],[0,8,0,10],[115,1,115,3],[115,6,115,10],[116,1,116,3],[116,6,116,10],[117,1,117,10],[118,0,118,10],[111,1,111,3],[111,6,111,10],[112,1,112,3],[112,6,112,10],[113,1,113,10],[114,0,114,10],[107,1,107,3],[107,6,107,10],[108,1,108,3],[108,6,108,10],[109,1,109,10],[110,0,110,10],[95,0,95,10],[97,0,97,10],[99,0,99,10],[100,1,100,9],[119,1,119,3],[119,6,119,10],[120,1,120,3],[120,6,120,10],[105,0,105,10],[106,0,106,10],[86,1,86,5],[87,1,88,5],[87,7,87,10],[88,7,88,10],[89,0,89,10],[93,0,93,10],[101,0,101,10],[102,1,102,5],[103,1,103,5],[104,1,104,8]]}
[null,null,null,null,null,null,null,null,"Diseñado por Ing. Gregor Rojas\nCaracas-Venezuela"]
["PROGRAMA DE CÁLCULO DEL RIESGO POR DESCARGAS ATMOSFERICAS\nBASADO EN IEC 62305-2 2006"]
["CARACTERÍSTICAS DE LA ESTRUCTURA"]
["L","Ingrese el largo de la estructura L (m)",null,null,null,null,40]
["W","Ingrese el ancho de la estructura W (m)",null,null,null,null,50]
["Hb","Ingrese la altura máxima de la estructura H (m)",null,null,null,null,25]
[null,"Marque si la estructura posee parte sobresaliente.",null,null,null,null,true]
["Hp","Ingrese la altura máxima de la estructura sobresaliente Hp (m)",null,null,null,null,{"$f":"IF(G7=TRUE,H8,G6)","v":5},5]
["Cd/b","Seleccione la ubicación de la estructura",null,null,null,null,1]
["Ce","Seleccione el ambiente donde se localizan las acometidas",null,null,null,null,2]
["ru","Seleccione el tipo de suelo existente en el interior ",null,null,null,null,1]
["ra","Seleccione el tipo de terreno existente en el exterior ",null,null,null,null,4]
["Ng","Ingrese la densidad de descargas atmosféricas a tierra (Rayos/km²-año) ",null,null,null,null,20]
["DDT","Mapa de Venezuela con densidad de descargas atmosféricas a tierra"]
["CARACTERÍSTICAS DE LOS SERVICIOS"]
["ACOMETIDA DE POTENCIA"]
[null,"Marcar si la acometida de potencia proviene  de una estructura adyacente",null,null,null,null,true,187]
["La","Ingrese la longitud de la estructura adyacente La (m) ",null,null,null,null,{"$f":"IF(G17=TRUE,H18,0)","v":10},10]
["Wa","Ingrese el ancho de la estructura adyacente Wa (m)",null,null,null,null,{"$f":"IF(G17=TRUE,H19,0)","v":5},5]
["Ha","Ingrese la altura de la estructura adyacente Ha (m)",null,null,null,null,{"$f":"IF(G17=TRUE,H20,0)","v":15},15]
[" ρ","Resistividad del suelo ρ (Ωm) (Considerar hasta un máximo de 500 Ωm)",null,null,null,null,150]
["Cd/a","Seleccione como es el lugar donde se encuentra el servicio",null,null,null,null,3]
[null,"Seleccione el tipo de la acometida ",null,null,"Aérea",null,2,null,"Enterrada o Subterránea"]
["Hc","Ingrese la altura de los conductores del servicio sobre el terreno Hc (m)",null,null,null,null,{"$f":"IF(G23=1,H24,0)","v":0},0]
["Lc","Ingrese la longitud de la acometida de servicio Lc (m)",null,null,null,null,0]
["Ct","Seleccione la existencia de transformador AT/BT en la acometida",null,null,null,null,2]
["ACOMETIDA DE TELECOMUNICACIONES "]
[null,"Marcar si la acometida proviene  de una estructura adyacente",null,null,null,null,false]
["La","Ingrese la longitud de la estructura adyacente La (m) ",null,null,null,null,{"$f":"IF(G28=TRUE,H29,0)","v":0},0]
["Wa","Ingrese el ancho de la estructura adyacente Wa (m)",null,null,null,null,{"$f":"IF(G28=TRUE,H30,0)","v":0},0]
["Ha","Ingrese la altura de la estructura adyacente Ha (m)",null,null,null,null,{"$f":"IF(G28=TRUE,H31,0)","v":0},0]
["Cd/a","Seleccione como es el lugar donde se encuentra el servicio",null,null,null,null,3]
["n","Ingrese el número de servicios conectados de comunicaciones",null,null,null,null,0,4]
[null,"Seleccione el tipo de la acometida ",null,null,"Aérea",null,1,null,"Enterrada o Subterránea"]
["Hc","Ingrese la altura de los conductores de comunicaciones desde el suelo Hc (m)",null,null,null,null,{"$f":"IF($G$34=0,0,IF($G$34=1,$H$35,0))","v":0},0]
[null,"Ingrese la longitud de la acometida de servicio (m)",null,null,null,null,{"$f":"IF(G33=0,0,H36)","v":0},0]
["OTRO TIPO DE ACOMETIDA"]
[null,"Marcar si la acometida de otro tipo proviene  de una estructura adyacente",null,null,null,null,false]
["La","Longitud de la estructura adyacente La (m) ",null,null,null,null,{"$f":"IF(G38=TRUE,H39,0)","v":0},0]
["Wa","Ancho de la estructura adyacente Wa (m)",null,null,null,null,{"$f":"IF(G38=TRUE,H40,0)","v":0},0]
{"$rows_left_out":83}
{"sheet":"Calculos","index":1,"n_rows":334,"n_cols":9,"rows_kept":334,"cut":false,"hidden":false,"merged":[[322,0,322,9],[1,0,1,9],[278,0,278,9],[155,0,155,9],[159,0,159,9],[162,0,162,9],[165,0,165,9],[173,0,173,9],[170,0,170,9],[227,0,227,9],[176,0,176,9],[179,0,179,9],[182,0,182,9],[188,0,188,9],[191,0,191,9],[197,0,197,9],[218,0,218,9],[58,0,58,9],[5,0,5,9],[22,0,22,9],[50,0,50,9],[52,0,52,9],[55,0,55,9],[30,0,30,9],[26,0,26,9],[34,0,34,9],[38,0,38,9],[42,0,42,9],[46,0,46,9],[10,0,10,9],[14,0,14,9],[92,0,92,9],[96,0,96,9],[99,0,99,9],[102,0,102,9],[215,0,215,9],[74,0,74,9],[77,0,77,9],[80,0,80,9],[86,0,86,9],[88,0,88,9],[272,0,272,9],[233,0,233,9],[236,0,236,9],[239,0,239,9],[242,0,242,9],[245,0,245,9],[248,0,248,9],[260,0,260,9],[263,0,263,9],[266,0,266,9],[269,0,269,9],[254,0,254,9],[257,0,257,9],[302,0,302,9],[314,0,314,9],[275,0,275,9],[287,0,287,9],[290,0,290,9],[293,0,293,9],[296,0,296,9],[299,0,299,9],[281,0,281,9],[284,0,284,9],[305,0,305,9],[308,0,308,9],[311,0,311,9],[0,8,0,9],[200,0,200,9],[206,0,206,9],[209,0,209,9],[212,0,212,9],[203,0,203,9],[138,0,138,9],[128,0,128,9],[131,0,131,9],[168,0,168,9],[141,0,141,9],[145,0,145,9],[149,0,149,9],[152,0,152,9],[109,0,109,9],[112,0,112,9],[3,0,3,9],[185,0,185,9],[194,0,194,9],[230,0,230,9],[251,0,251,9],[224,0,224,9],[221,0,221,9],[115,0,115,9],[134,0,134,9],[119,0,119,9],[122,0,122,9],[125,0,125,9],[18,0,18,9],[106,0,106,9],[61,0,61,9],[68,0,68,9]]}
[null,null,null,null,null,null,null,null,"Diseñado por Ing. Gregor Rojas\nCaracas-Venezuela"]
["HOJA DE CALCULOS "]
[]
["PROMEDIO ANUAL DE DESCARGAS"]
[]
["CALCULO DEL NUMERO DE SUCESOS PELIGROSOS POR DESCARGA EN UNA ESTRUCTURA"]
["Admax",{"$f":"('Menu principal'!$G$4*'Menu principal'!$G$5)+((6*'Menu principal'!$G$8)*('Menu principal'!$G$4+'Menu principal'!$G$5))+(9*PI()*'Menu principal'!$G$8^2)","v":5406.8583470577032},"Ad'",{"$f":"9*PI()*('Menu principal'!$G$8^2)","v":706.85834705770344},"A'D = 9 X pi X (HP)2"]
["Ad=Admin",{"$f":"('Menu principal'!$G$4*'Menu principal'!$G$5)+((6*'Menu principal'!$G$6)*('Menu principal'!$G$4+'Menu principal'!$G$5))+(9*PI()*'Menu principal'!$G$6^2)","v":33171.458676442591},"Ad''",{"$f":"IF($B$8>$D$7,$B$8,$D$7)","v":33171.458676442591},"AD = L X W + 6H X (L + W) +pi X 9H2"]
["ND",{"$f":"'Menu principal'!$G$13*(IF('Menu principal'!$G$7=TRUE,$D$8,$B$8))*(CHOOSE('Menu principal'!$G$9,0.25,0.5,1,2))*10^-6","v":0.16585729338221294},null,null,"ND = NG X Ad X Cd X 10-6"]
[]
["CALCULO DEL NUMERO DE SUCESOS PELIGROSOS ESTRUCTURA ADYACENTE (ACOMETIDA DE POTENCIA)"]
["Ad/a(P)",{"$f":"'Menu principal'!$G$18*'Menu principal'!$G$19+6*'Menu principal'!$G$20*('Menu principal'!$G$18+'Menu principal'!$G$19)+9*PI()*'Menu principal'!$G$20^2","v":7761.7251235193307},null,null,"Ad/a(P) = L X W + 6H X (L + W) +pi X 9H2"]
["Nd/a(P)",{"$f":"'Menu principal'!$G$13*$B$12*CHOOSE('Menu principal'!$G$22,0.25,0.5,1,2)*IF('Menu principal'!$G$26=1,0.2,1)*10^-6","v":0.15523450247038661},null,null,"Nd/a(P) = NG X Ad/a(P) X CD/a(P) X Ct X 10-6"]
[]
["CALCULO DEL NUMERO DE SUCESOS PELIGROSOS ESTRUCTURA ADYACENTE (ACOMETIDA DE COMUNICACIONES)"]
["Ad/a(T)",{"$f":"'Menu principal'!$G$29*'Menu principal'!$G$30+6*'Menu principal'!$G$31*('Menu principal'!$G$29+'Menu principal'!$G$30)+9*PI()*'Menu principal'!$G$31^2","v":0},null,null,"Ad/a(T) = L X W + 6H X (L + W) +pi X 9H2"]
["Nd/a(T)",{"$f":"'Menu principal'!$G$13*$B$16*CHOOSE('Menu principal'!$G$32,0.25,0.5,1,2)*10^-6","v":0},null,null,"Nd/a(T) = NG X Ad/a(T) X CD/a(T) X 10-6"]
[]
["CALCULO DEL NUMERO DE SUCESOS PELIGROSOS ESTRUCTURA ADYACENTE (ACOMETIDA OTROS)"]
["Ad/a(O)",{"$f":"'Menu principal'!$G$39*'Menu principal'!$G$40+6*'Menu principal'!$G$41*('Menu principal'!$G$39+'Menu principal'!$G$40)+9*PI()*'Menu principal'!$G$41^2","v":0},null,null,"Ad/a(O) = L X W + 6H X (L + W) +pi X 9H2"]
["Nd/a(O)",{"$f":"'Menu principal'!$G$13*$B$20*CHOOSE('Menu principal'!$G$42,0.25,0.5,1,2)*1*10^-6","v":0},null,null,"Nd/a(O) = NG X Ad/a(O) X CD/a(O) X 10-6"]
[]
["CALCULO DEL PROMEDIO ANUAL DE SUCESOS PELIGROSOS POR DESCARGAS CERCA DE LA ESTRUCTURA"]
["AM",{"$f":"2*250*('Menu principal'!$G$4+'Menu principal'!$G$6)+PI()*250^2","v":228849.54084936206},"NM",{"$f":"'Menu principal'!$G$13*($B$24-IF('Menu principal'!$G$7=TRUE,$D$8,$B$8))*(CHOOSE('Menu principal'!$G$9,0.25,0.5,1,2))*10^-6","v":0.97839041086459733},"AM = 2 X 250 X (L + W) + pi  X 2502"]
["NM",{"$f":"IF($D$24<0,0,$D$24)","v":0.97839041086459733},null,null,"NM = NG X (AM - Ad/b X Cd/b) X 10-6"]
[]
["CALCULO DEL PROMEDIO ANUAL DE DESCARGAS SOBRE LAS ACOMETIDAS DE SERVICIOS DE POTENCIA"]
["AL(P)",{"$f":"IF('Menu principal'!$G$23=1,$D$28,$D$29)","v":-1469.6938456699068},"AL Aérea",{"$f":"('Menu principal'!$G$25-3*('Menu principal'!$G$20+'Menu principal'!$G$6))*6*'Menu principal'!$G$24","v":0},"AL aérea = (LC - 3(Ha + Hb) X 6Hc",null,null,null,"AL enterrada = (LC - 3(Ha + Hb) X RAIZ ρ"]
["NL(P)",{"$f":"'Menu principal'!$G$13*$B$28*(CHOOSE('Menu principal'!$G$22,0.25,0.5,1,2))*(IF('Menu principal'!$G$26=1,0.2,1))*10^-6","v":-2.9393876913398131E-2},"AL Enterrada",{"$f":"('Menu principal'!$G$25-3*('Menu principal'!$G$20+'Menu principal'!$G$6))*SQRT('Menu principal'!$G$21)","v":-1469.6938456699068},"NL(P) = NG X AL(P) X CDa(P) X Ct X 10-6"]
[]
["CALCULO DEL PROMEDIO ANUAL DE DESCARGAS SOBRE LAS ACOMETIDAS DE SERVICIOS DE COMUNICACIONES"]
["AL(T)",{"$f":"IF('Menu principal'!$G$34=1,$D$32,$D$33)","v":0},"AL Aérea",{"$f":"('Menu principal'!$G$36-3*('Menu principal'!$G$31+'Menu principal'!G6))*6*'Menu principal'!$G$35","v":0},"AL aérea = (LC - 3(Ha + Hb) X 6Hc",null,null,null,"AL enterrada = (LC - 3(Ha + Hb) X RAIZ ρ"]
["NL(T)",{"$f":"'Menu principal'!$G$13*$B$32*(CHOOSE('Menu principal'!$G$32,0.25,0.5,1,2))*10^-6","v":0},"AL Enterrada",{"$f":"('Menu principal'!$G$36-3*('Menu principal'!$G$31+'Menu principal'!G6))*SQRT('Menu principal'!$G$21)","v":-918.55865354369178},"NL(T) = NG X AL(T) X CD/a(T) X 10-6"]
[]
["CALCULO DEL PROMEDIO ANUAL DE DESCARGAS SOBRE LAS ACOMETIDAS DE SERVICIOS DE OTRO"]
["AL(O)",{"$f":"IF('Menu principal'!$G$44=1,$D$36,$D$37)","v":0},"AL Aérea",{"$f":"('Menu principal'!$G$46-3*('Menu principal'!$G$41+'Menu principal'!$G$6))*6*'Menu principal'!$G$45","v":0},"AL aérea = (LC - 3(Ha + Hb) X 6Hc",null,null,null,"AL enterrada = (LC - 3(Ha + Hb) X RAIZ ρ"]
["NL(O)",{"$f":"'Menu principal'!$G$13*$B$36*(CHOOSE('Menu principal'!$G$42,0.25,0.5,1,2))*10^-6","v":0},"AL Enterrada",{"$f":"('Menu principal'!$G$46-3*('Menu principal'!$G$41+'Menu principal'!$G$6))*SQRT('Menu principal'!$G$21)","v":-918.55865354369178},"NL(O) = NG X AL(O) X CD/a(O) X 10-6"]
[]
["CALCULO DEL PROMEDIO ANUAL DE DESCARGAS CERCA DE LAS ACOMETIDAS DE POTENCIA"]
["Ai(P)",{"$f":"IF('Menu principal'!$G$23=1,$D$40,$D$41)","v":0},"Ai Aérea",{"$f":"1000*'Menu principal'!$G$25","v":0},"Ai aérea = 1000 x LC",null,null,null,"Ai enterrada = 25 x LC X RAIZ ρ"]
{"$rows_left_out":295}
{"sheet":"tablas de factores","index":2,"n_rows":151,"n_cols":6,"rows_kept":151,"cut":false,"hidden":false,"merged":[[53,0,53,2],[59,3,59,5],[60,0,60,2],[60,3,60,5],[61,0,61,2],[61,3,61,5],[56,0,56,2],[56,3,56,5],[57,0,57,2],[57,3,57,5],[58,3,58,5],[3,0,3,5],[1,0,1,5],[77,0,77,2],[78,0,78,2],[58,0,58,2],[74,0,74,2],[44,0,44,5],[45,0,45,4],[59,0,59,2],[52,0,52,5],[54,0,54,2],[54,3,54,5],[55,0,55,2],[55,3,55,5],[62,0,62,2],[62,3,62,5],[28,0,28,4],[4,0,4,4],[10,0,10,5],[11,2,11,3],[11,4,11,5],[13,2,13,3],[13,4,13,5],[15,0,15,5],[16,0,16,4],[20,0,20,5],[21,0,21,4],[27,0,27,5],[89,0,89,5],[34,0,34,5],[35,0,35,3],[64,0,64,5],[65,0,65,4],[73,0,73,5],[53,3,53,5],[42,0,42,4],[41,0,41,4],[80,0,80,5],[81,0,82,0],[81,1,82,1],[81,2,82,2],[81,3,81,5],[75,0,75,2],[76,0,76,2],[90,0,90,4],[93,0,93,4],[98,0,98,4],[102,0,102,5],[103,0,103,1],[103,2,103,3],[103,4,103,5],[104,4,104,5],[105,2,105,3],[105,4,105,5],[106,2,106,3],[106,4,106,5],[0,4,0,5],[142,0,142,4],[146,0,146,4],[139,0,139,4],[107,2,107,3],[107,4,107,5],[109,0,109,5],[110,0,110,4],[115,0,115,5],[116,0,116,4],[123,0,123,5],[124,0,124,4],[133,0,133,5],[134,0,134,3],[138,0,138,5],[104,2,104,3]]}
[null,null,null,null,"Diseñado por Ing. Gregor Rojas\nCaracas-Venezuela"]
["TABLAS DE FACTORES"]
[]
["TABLA A.2 Factor de localización Cd"]
["Situación relativa",null,null,null,null,"Cd"]
["Rodeado por objetos más altos o por árboles ",null,null,null,null,0.25]
["Rodeado por objetos o árboles de la misma o menor altura",null,null,null,null,0.5]
["Aislado sin otros objetos en las proximidades",null,null,null,null,1]
["Aislado en la parte superior de una colina o de un montículo",null,null,null,null,2]
[]
["TABLA A.3 Áreas de captación AL y Ai en función de las características del servicio"]
[null,null,"Aérea",null,"Enterrada"]
["Aérea","Al"]
["Enterrada","Ai","1000Lc"]
[]
["TABLA A.4 Factor por transformador"]
["Transformador",null,null,null,null,"Ct"]
["Servicio con un transformador de dos arrollamientos",null,null,null,null,0.2]
["Solamente el servicio",null,null,null,null,1]
[]
["TABLA A.5 Factor ambiental"]
["Ambiente",null,null,null,null,"Ce"]
["Urbano con edificios de altura superior a 20 m",null,null,null,null,0.01]
["Urbano con edificios de altura entre 10 y 20 m",null,null,null,null,0.1]
["Suburbano con edificios de altura inferior a 10 m",null,null,null,null,0.5]
["Rural",null,null,null,null,1]
[]
["TABLA B.1  Valores de la probabilidad PA de que una descarga en la estructura \nproduzca impactos en los seres vivos por voltajes de paso y contacto"]
["Medidas de protección",null,null,null,null,"PA"]
["Sin medidas de protección",null,null,null,null,1]
["Aislamiento eléctrico de los conductores expuestos",null,null,null,null,{"$f":"10^-2","v":0.01}]
["Equipotenciación efectiva del terreno",null,null,null,null,{"$f":"10^-2","v":0.01}]
["Avisos",null,null,null,null,{"$f":"10^-1","v":0.1}]
[]
["TABLA B.2 Valores de PB en función de medidas de protección para reducir daños físicos"]
["Característica de la estructura",null,null,null,"Nivel","PB"]
["Estructura no protegida por un SPCR",null,null,null,null,1]
["Estructura protegida por un SPCR",null,null,null,"IV",0.2]
["Estructura protegida por un SPCR",null,null,null,"III",0.1]
["Estructura protegida por un SPCR",null,null,null,"III",0.05]
{"$rows_left_out":112}
{"sheet":"imagenes","index":3,"n_rows":94,"n_cols":26,"rows_kept":94,"cut":false,"hidden":false,"merged":[[31,2,31,4],[31,10,31,12],[3,8,3,20],[4,7,11,7],[8,18,8,19],[9,17,10,17],[18,6,18,7],[27,1,27,25],[28,1,28,25],[30,2,30,4],[30,10,30,12],[30,21,30,23],[52,1,52,25],[53,1,53,25],[55,2,55,4],[55,10,55,12],[55,21,55,23],[35,5,35,7],[35,14,35,15],[35,21,35,24],[42,13,42,16],[43,1,43,11],[43,20,43,25],[80,10,80,12],[80,21,80,23],[75,22,75,27],[56,2,56,4],[56,10,56,12],[92,13,92,16],[93,1,93,11],[93,20,93,25],[81,2,81,4],[81,10,81,12],[0,22,0,27],[25,22,25,27],[50,22,50,27],[1,1,1,25],[85,5,85,7],[85,14,85,15],[85,21,85,24],[60,5,60,7],[60,14,60,15],[60,21,60,24],[67,13,67,16],[68,1,68,11],[68,20,68,25],[77,1,77,25],[78,1,78,25],[80,2,80,4]]}
[null,null,null,null,null,null,null,null,null,null,null,null,null,null,null,null,null,null,null,null,null,null,"Diseñado por Ing. Gregor Rojas\nCaracas-Venezuela"]
[null,"DIMENSIONES DE LA ESTRUCTURA EN FORMA COMPLEJA"]
[]
[null,null,null,null,null,null,null,null,{"$f":"'Menu principal'!G4&\" m (L)\"","v":"40 m (L)"}]
[null,null,null,null,null,null,null,{"$f":"'Menu principal'!G5&\" m (W)\"","v":"50 m (W)"}]
[]
[]
[]
[null,null,null,null,null,null,null,null,null,null,null,null,null,null,null,null,null,null,{"$f":"8&\" m\"","v":"8 m"}]
[null,null,null,null,null,null,null,null,null,null,null,null,null,null,null,null,null,{"$f":"8&\" m\"","v":"8 m"}]
[]
[]
[null,null,null,null,null,null,null,null,null,null,null,null,null,null,"VISTA DE PLANTA"]
[]
[]
[]
[]
[null,null,null,null,null,null,null,null,null,null,null,null,null,null,null,null,null,null,null,null,null,null,{"$f":"'Menu principal'!G8&\" m (Hp)\"","v":"5 m (Hp)"}]
[null,null,null,null,null,null,{"$f":"'Menu principal'!G6&\" m (W)\"","v":"25 m (W)"}]
[]
[]
[null,null,null,null,null,null,null,null,null,null,null,null,null,null,"VISTA LATERAL"]
[]
[]
[]
[null,null,null,null,null,null,null,null,null,null,null,null,null,null,null,null,null,null,null,null,null,null,"Diseñado por Ing. Gregor Rojas\nCaracas-Venezuela"]
[]
[null,"DIMENSIONES DE LA ESTRUCTURA A PROTEGER Y DE LA ADYACENTE"]
[null,"POTENCIA"]
[]
[null,"Ad =",{"$f":"Calculos!$B$8","v":33171.458676442591},null,null,null,null,null,null,"Ai(P) =",{"$f":"Calculos!B40","v":0},null,null,null,null,null,null,null,null,null,"Ad(P)=",{"$f":"Calculos!B12","v":7761.7251235193307}]
[null,"Am =",{"$f":"Calculos!$B$24","v":228849.54084936206},null,null,null,null,null,null,"Al(P) =",{"$f":"Calculos!B28","v":-1469.6938456699068}]
[]
[]
[]
[null,null,null,null,null,{"$f":"'Menu principal'!G4&\" m (Lb)\"","v":"40 m (Lb)"},null,null,null,null,null,null,null,null,"2 Di",null,null,null,null,null,null,{"$f":"'Menu principal'!$G$18&\" m (La)\"","v":"10 m (La)"}]
[]
[null,null,{"$f":"'Menu principal'!G5&\" m (W)\"","v":"50 m (W)"},null,null,null,null,null,null,null,null,null,null,null,null,null,null,null,null,null,null,null,null,null,null,{"$f":"'Menu principal'!$G$19&\" m (Wa)\"","v":"5 m (Wa)"}]
[]
[]
{"$rows_left_out":55}
{"sheet":"DDT","index":4,"n_rows":29,"n_cols":10,"rows_kept":29,"cut":false,"hidden":false,"merged":[[2,1,2,4],[2,6,2,9],[0,8,0,9]]}
[null,null,null,null,null,null,null,null,"Diseñado por Ing. Gregor Rojas\nCaracas-Venezuela"]
[]
[null,"MAPA CENAURICO DE VENEZUELA",null,null,null,null,"TABLA DE DDT EN CIUDADES CAPITALES"]
[]
[null,null,null,null,null,null,"Ciudades Capitales","Latitud","Longitud","Densidad Promedio (DDT) (Número de Descargas/km2/Año)"]
[null,null,null,null,null,null,"Barcelona","10°04'0″ N","- 64°43'0″ O",2]
[null,null,null,null,null,null,"Barinas","8°38′ N","- 70°12′ O",2]
[null,null,null,null,null,null,"Barquisimeto","10º04' N","- 69º18' O",4]
[null,null,null,null,null,null,"Caracas","10°30'0″ N","- 66°55'0″ O",1]
[null,null,null,null,null,null,"Ciudad Bolívar","8°05'15\" N","- 63°31'39\" O",2]
[null,null,null,null,null,null,"Coro","11º24' N","- 69º41' O",4]
[null,null,null,null,null,null,"Cumaná","10°27'23″ N","- 64°10′3″ O",1]
[null,null,null,null,null,null,"Guanare","9º02’37” N","- 68º44’56” O",6]
[null,null,null,null,null,null,"La Asunción","11°01′39″ N","- 63°51′46″ O",0.5]
[null,null,null,null,null,null,"La Guaira","10º36' N","- 66º55' O",1]
[null,null,null,null,null,null,"Los Teques","10º20'34\" N","- 67º02'44\" O",1.5]
[null,null,null,null,null,null,"Maracaibo","10°37'0″ N","- 71º37'0\" O",20]
[null,null,null,null,null,null,"Maracay","10º14'49\" N","- 67º35'45\" O",2]
[null,null,null,null,null,null,"Maturín","9º42'49\" N","- 63º11'15\" O",2]
[null,null,null,null,null,null,"Mérida","8°34'0″ N","- 71º7'0\" O",2]
[null,null,null,null,null,null,"Puerto Ayacucho","5º35'40\" N","- 67º41'49\" O",3]
[null,null,null,null,null,null,"San Carlos","9°39'30\" N","- 68°35'24\" O",4]
[null,null,null,null,null,null,"San Cristobal","7º46' N","- 72º14' O",1]
[null,null,null,null,null,null,"San Felipe","10º20'25\" N","- 68º44'09\" O",4]
[null,null,null,null,null,null,"San Fernando de Apure","7°54′0″ N","- 67°28′0″ O",8]
[null,null,null,null,null,null,"San Juan de los Morros","09º54'39\" N","- 67º21'29\" O",2]
[null,null,null,null,null,null,"Trujillo","09º22'0\" N","- 70º25'59\" O",2]
[null,null,null,null,null,null,"Tucupita","09°03'33\" N","- 62°04'05\" O",1]
[null,null,null,null,null,null,"Valencia","10°10′0″ N","- 68°0′0″ O",3]

{"sheet":"Instrucciones","index":5,"n_rows":0,"n_cols":0,"rows_kept":0,"cut":false,"hidden":false,"merged":[]}